انجمن‌های فارسی اوبونتو

لطفاً به انجمن‌ها وارد شده و یا جهت ورود ثبت‌نام نمائید

لطفاً جهت ورود نام کاربری و رمز عبورتان را وارد نمائید

اوبونتو ۲۰٫۰۴٫۱ منتشر شد.
انتظار می‌ره همهٔ اعضا هرچه زودتر به این نگارش ارتقا پیدا کنند. همهٔ پاسخ‌ها از این به بعد، بر پایهٔ اوبونتو ۲۰٫۰۴٫۱ خواهد بود.

نویسنده موضوع: مشکل gradel در فلاتر  (دفعات بازدید: 193 بار)

0 کاربر و 1 مهمان درحال مشاهده موضوع.

آفلاین ali7rangoo

  • Full Member
  • *
  • ارسال: 187
  • جنسیت : پسر
مشکل gradel در فلاتر
« : 06 امرداد 1399، 10:13 ب‌ظ »
سلام خدمت دوستان نمیدونم میشه این مسائل رو اینجا مطرح کرد یا نه ولی جایی دیگه هم مطرح کردم ولی جوابی نگرفتم،(فکر کنم این انجمن تنها جایی هست که دست خالی برنمیگردیم ;D)
بالاخره فلاتر هم آزاد و اوپن سورسه پس میپرسم:
فلاتر رو کامل نصب کردم وآخرین نسخه SDK رو از طریق اندروید استودیو دانلود کردم 
ولی وقتی میخوام از پروژه فلاتر ران بگیرم چه به وسیله اندروید استودیو چه vscode 
و چه با موبایل و چه با genymotion این ارور رو بهم میده

Launching lib/main.dart on Google Nexus 4 in debug mode...Running Gradle task 'assembleDebug'...FAILURE: Build failed with an exception.* What went wrong:A problem occurred configuring root project 'android'.> Could not resolve all artifacts for configuration ':classpath'.> Could not find com.android.tools.build:gradle:3.5.0.Searched in the following locations:- https://dl.google.com/dl/android/maven2/com/android/tools/build/gradle/3.5.0/gradle-3.5.0.pom- https://dl.google.com/dl/android/maven2/com/android/tools/build/gradle/3.5.0/gradle-3.5.0.jar- https://jcenter.bintray.com/com/android/tools/build/gradle/3.5.0/gradle-3.5.0.pom- https://jcenter.bintray.com/com/android/tools/build/gradle/3.5.0/gradle-3.5.0.jarRequired by:project :* Try:Run with --stacktrace option to get the stack trace. Run with --info or --debug option to get more log output. Run with --scan to get full insights.* Get more help at https://help.gradle.orgBUILD FAILED in 2m 20sException: Gradle task assembleDebug failed with exit code 1

کسی هست بدونه چیکار باید بکنم؟
خداوند دنیا رو open source قرار داده .
پس باید سورسشو تغییر بدیم و اون رو به  سوی مثبت ببریم.
nano world

آفلاین warlock

  • Jr. Member
  • *
  • ارسال: 70
پاسخ : مشکل gradel در فلاتر
« پاسخ #1 : 07 امرداد 1399، 03:13 ق‌ظ »
شکن یا تحریم شکن بزن احتمالا درست می شه

آفلاین ali7rangoo

  • Full Member
  • *
  • ارسال: 187
  • جنسیت : پسر
پاسخ : مشکل gradel در فلاتر
« پاسخ #2 : 07 امرداد 1399، 10:26 ق‌ظ »
شکن یا تحریم شکن بزن احتمالا درست می شه
lantern  هنگام دانلود فعال بود و الآن هم فعاله ولی هیچ که هیچ هست  ](*,)
خداوند دنیا رو open source قرار داده .
پس باید سورسشو تغییر بدیم و اون رو به  سوی مثبت ببریم.
nano world

آفلاین naja

  • Newbie
  • *
  • ارسال: 21
  • جنسیت : پسر
پاسخ : مشکل gradel در فلاتر
« پاسخ #3 : 09 شهریور 1399، 03:13 ب‌ظ »
سلام خدمت دوستان نمیدونم میشه این مسائل رو اینجا مطرح کرد یا نه ولی جایی دیگه هم مطرح کردم ولی جوابی نگرفتم،(فکر کنم این انجمن تنها جایی هست که دست خالی برنمیگردیم ;D)
بالاخره فلاتر هم آزاد و اوپن سورسه پس میپرسم:
فلاتر رو کامل نصب کردم وآخرین نسخه SDK رو از طریق اندروید استودیو دانلود کردم 
ولی وقتی میخوام از پروژه فلاتر ران بگیرم چه به وسیله اندروید استودیو چه vscode 
و چه با موبایل و چه با genymotion این ارور رو بهم میده

Launching lib/main.dart on Google Nexus 4 in debug mode...Running Gradle task 'assembleDebug'...FAILURE: Build failed with an exception.* What went wrong:A problem occurred configuring root project 'android'.> Could not resolve all artifacts for configuration ':classpath'.> Could not find com.android.tools.build:gradle:3.5.0.Searched in the following locations:- https://dl.google.com/dl/android/maven2/com/android/tools/build/gradle/3.5.0/gradle-3.5.0.pom- https://dl.google.com/dl/android/maven2/com/android/tools/build/gradle/3.5.0/gradle-3.5.0.jar- https://jcenter.bintray.com/com/android/tools/build/gradle/3.5.0/gradle-3.5.0.pom- https://jcenter.bintray.com/com/android/tools/build/gradle/3.5.0/gradle-3.5.0.jarRequired by:project :* Try:Run with --stacktrace option to get the stack trace. Run with --info or --debug option to get more log output. Run with --scan to get full insights.* Get more help at https://help.gradle.orgBUILD FAILED in 2m 20sException: Gradle task assembleDebug failed with exit code 1

کسی هست بدونه چیکار باید بکنم؟
فک کنم گوگل گریدل ۳.۵ رو ورداشته از این آدرسش به یه دلیل واضح
گریدل ۳.۵ خیلی قدیمیه (June 2017)الان گریدل ۶.۶.۱ اومده آپدیت کن (نمیدونم اینتلیج آیدیا [اندروید استودیو] چجوری آپدیت میشه این داستاناش)
ادیت: رفتم دیدم آدرسارو ۴۰۴ میدن آپدیت کن
« آخرین ویرایش: 09 شهریور 1399، 03:16 ب‌ظ توسط naja »

آفلاین ali7rangoo

  • Full Member
  • *
  • ارسال: 187
  • جنسیت : پسر
پاسخ : مشکل gradel در فلاتر
« پاسخ #4 : 09 شهریور 1399، 05:53 ب‌ظ »
سلام خدمت دوستان نمیدونم میشه این مسائل رو اینجا مطرح کرد یا نه ولی جایی دیگه هم مطرح کردم ولی جوابی نگرفتم،(فکر کنم این انجمن تنها جایی هست که دست خالی برنمیگردیم ;D)
بالاخره فلاتر هم آزاد و اوپن سورسه پس میپرسم:
فلاتر رو کامل نصب کردم وآخرین نسخه SDK رو از طریق اندروید استودیو دانلود کردم 
ولی وقتی میخوام از پروژه فلاتر ران بگیرم چه به وسیله اندروید استودیو چه vscode 
و چه با موبایل و چه با genymotion این ارور رو بهم میده

Launching lib/main.dart on Google Nexus 4 in debug mode...Running Gradle task 'assembleDebug'...FAILURE: Build failed with an exception.* What went wrong:A problem occurred configuring root project 'android'.> Could not resolve all artifacts for configuration ':classpath'.> Could not find com.android.tools.build:gradle:3.5.0.Searched in the following locations:- https://dl.google.com/dl/android/maven2/com/android/tools/build/gradle/3.5.0/gradle-3.5.0.pom- https://dl.google.com/dl/android/maven2/com/android/tools/build/gradle/3.5.0/gradle-3.5.0.jar- https://jcenter.bintray.com/com/android/tools/build/gradle/3.5.0/gradle-3.5.0.pom- https://jcenter.bintray.com/com/android/tools/build/gradle/3.5.0/gradle-3.5.0.jarRequired by:project :* Try:Run with --stacktrace option to get the stack trace. Run with --info or --debug option to get more log output. Run with --scan to get full insights.* Get more help at https://help.gradle.orgBUILD FAILED in 2m 20sException: Gradle task assembleDebug failed with exit code 1

کسی هست بدونه چیکار باید بکنم؟
فک کنم گوگل گریدل ۳.۵ رو ورداشته از این آدرسش به یه دلیل واضح
گریدل ۳.۵ خیلی قدیمیه (June 2017)الان گریدل ۶.۶.۱ اومده آپدیت کن (نمیدونم اینتلیج آیدیا [اندروید استودیو] چجوری آپدیت میشه این داستاناش)
ادیت: رفتم دیدم آدرسارو ۴۰۴ میدن آپدیت کن
همیشه بعد از صبر طولانی مدت و فعال بودن فیل***** اوکی میشه ولی مشکل الآن اینه که همیشه این فرایند طول میکشه(خیلی)
خداوند دنیا رو open source قرار داده .
پس باید سورسشو تغییر بدیم و اون رو به  سوی مثبت ببریم.
nano world

آفلاین naja

  • Newbie
  • *
  • ارسال: 21
  • جنسیت : پسر
پاسخ : مشکل gradel در فلاتر
« پاسخ #5 : 09 شهریور 1399، 08:22 ب‌ظ »
سلام خدمت دوستان نمیدونم میشه این مسائل رو اینجا مطرح کرد یا نه ولی جایی دیگه هم مطرح کردم ولی جوابی نگرفتم،(فکر کنم این انجمن تنها جایی هست که دست خالی برنمیگردیم ;D)
بالاخره فلاتر هم آزاد و اوپن سورسه پس میپرسم:
فلاتر رو کامل نصب کردم وآخرین نسخه SDK رو از طریق اندروید استودیو دانلود کردم 
ولی وقتی میخوام از پروژه فلاتر ران بگیرم چه به وسیله اندروید استودیو چه vscode 
و چه با موبایل و چه با genymotion این ارور رو بهم میده

Launching lib/main.dart on Google Nexus 4 in debug mode...Running Gradle task 'assembleDebug'...FAILURE: Build failed with an exception.* What went wrong:A problem occurred configuring root project 'android'.> Could not resolve all artifacts for configuration ':classpath'.> Could not find com.android.tools.build:gradle:3.5.0.Searched in the following locations:- https://dl.google.com/dl/android/maven2/com/android/tools/build/gradle/3.5.0/gradle-3.5.0.pom- https://dl.google.com/dl/android/maven2/com/android/tools/build/gradle/3.5.0/gradle-3.5.0.jar- https://jcenter.bintray.com/com/android/tools/build/gradle/3.5.0/gradle-3.5.0.pom- https://jcenter.bintray.com/com/android/tools/build/gradle/3.5.0/gradle-3.5.0.jarRequired by:project :* Try:Run with --stacktrace option to get the stack trace. Run with --info or --debug option to get more log output. Run with --scan to get full insights.* Get more help at https://help.gradle.orgBUILD FAILED in 2m 20sException: Gradle task assembleDebug failed with exit code 1

کسی هست بدونه چیکار باید بکنم؟
فک کنم گوگل گریدل ۳.۵ رو ورداشته از این آدرسش به یه دلیل واضح
گریدل ۳.۵ خیلی قدیمیه (June 2017)الان گریدل ۶.۶.۱ اومده آپدیت کن (نمیدونم اینتلیج آیدیا [اندروید استودیو] چجوری آپدیت میشه این داستاناش)
ادیت: رفتم دیدم آدرسارو ۴۰۴ میدن آپدیت کن
همیشه بعد از صبر طولانی مدت و فعال بودن فیل***** اوکی میشه ولی مشکل الآن اینه که همیشه این فرایند طول میکشه(خیلی)
https://paste.c-net.org/SneezeEnforcer
خدمت شما

آفلاین warlock

  • Jr. Member
  • *
  • ارسال: 70
پاسخ : مشکل gradel در فلاتر
« پاسخ #6 : 09 شهریور 1399، 09:52 ب‌ظ »


داخل اندروید استادیو با جاوا یا کاتلین یه گزینه هست به اسم offline mode که اگر یک بار پروژه رو سینک کنید دفعه های بعدی می تونید این گزینه رو فعال کنید تا بدون نیاز به اینترنت پروژه رو بیلد کنه احتمال خیلی زیاد این مورد برای فلاتر هم است

و از چه فیلتر شکنی استفاده می کنید؟ اگر از تور استفاده می کنید توصیه می شه عوضش کنید و مثلا بگذر، شکن یا fod استفاده کنید یا چیزی مثل protonVpn یا هر چیزی به غیر از تور


می تونید گریدل رو دانلود کنید و مثلا داخل یه پوشه بزاریدش و ادرسش رو بدید اگر نشد یه سرور مثل زمپ یا مشابه رو دانلود کنید و داخل زمپ بزاریدش و ادرس لوکال هاستش رو بدید.